Target
Envelope glycoprotein gp160
Ligand
BDBM359370
Substrate
Meas. Tech.
Biological Methods
EC50
<10±n/a nM
Comments
0.00 20220115
Citation
 Bender, JAGentles, RGPendri, AWang, AXMeanwell, NABeno, BRFridell, RABelema, MNguyen, VNYang, ZWang, GKumaravel, SThangathirupathy, SBora, ROHolehatti, SMMettu, MRPanda, M Inhibitors of human immunodeficiency virus replication US Patent  US10221129 Publication Date 3/5/2019 
Target
Name:
Envelope glycoprotein gp160
Synonyms:
Env polyprotein | NL4-3
Type:
Enzyme Catalytic Domain
Mol. Mass.:
97031.14
Organism:
Human immunodeficiency virus type 1 (isolate BRU/LAI group M subtypeB) (HIV-1)
Description:
Residue:
854
  
Inhibitor
Name:
BDBM359370
Synonyms:
US10221129, Example VN-14 | US10221129, Example VN-15
Type:
Small organic molecule
Emp. Form.:
C26H24F2N6O4S2
Mol. Mass.:
586.633
SMILES:
CC1CN(c2ncccc12)S(=O)(=O)NC(=O)N[C@@H](Cc1cc(F)cc(F)c1)C(=O)N(C)c1ccc2scnc2c1
: