Target
Mineralocorticoid receptor
Ligand
BDBM18622
Substrate
BDBM18207
Meas. Tech.
Competitive Ligand Binding Assay, GR-Mediated Agonist Activity Assay, and IL-6 Repression Assay
Ki
21±n/a nM
Citation
 Hudson, ARRoach, SLHiguchi, RIPhillips, DPBissonnette, RPLamph, WWYen, JLi, YAdams, MEValdez, LJVassar, ACuervo, CKallel, EAGharbaoui, CJMais, DEMiner, JNMarschke, KBRungta, DNegro-Vilar, AZhi, L Synthesis and characterization of nonsteroidal glucocorticoid receptor modulators for multiple myeloma. J Med Chem 50:4699-709 (2007)  
Target
Name:
Mineralocorticoid receptor
Synonyms:
MCR MLR NR3C2 | Nuclear receptor subfamily 3 group C member 2
Type:
Enzyme
Mol. Mass.:
107076.42
Organism:
Homo sapiens (Human)
Description:
P08235
Residue:
984
  
Inhibitor
Name:
BDBM18622
Synonyms:
(18Z)-18-({3-[(1E)-1-(hydroxyimino)ethyl]thiophen-2-yl}methylidene)-12-methoxy-3,5,5-trimethyl-17-oxa-6-azatetracyclo[8.8.0.0^{2,7}.0^{11,16}]octadeca-1(10),2(7),3,8,11,13,15-heptaen-13-ol | Oxime, 22
Type:
Small organic molecule
Emp. Form.:
C27H26N2O4S
Mol. Mass.:
474.571
SMILES:
COc1c(O)ccc2OC(=Cc3sccc3C(C)N=O)c3c(ccc4NC(C)(C)C=C(C)c34)-c12
:
Substrate
Name:
BDBM18207
Synonyms:
(1R,2S,10S,11S,13R,14R,15S,17S)-1-fluoro-14,17-dihydroxy-14-(2-hydroxyacetyl)-2,13,15-trimethyltetracyclo[8.7.0.0^{2,7}.0^{11,15}]heptadeca-3,6-dien-5-one US11554172, Compound Dexamethasone dexamethasone (tetramethyl-rhodamine conjugated )
Type:
Steroid
Emp. Form.:
C22H29FO5
Mol. Mass.:
392.4611
SMILES:
[H][C@@]12C[C@@H](C)[C@](O)(C(=O)CO)[C@@]1(C)C[C@H](O)[C@@]1(F)[C@@]2([H])CCC2=CC(=O)C=C[C@]12C
: