Target
Nuclear receptor ROR-gamma
Ligand
BDBM359495
Substrate
Meas. Tech.
Biological Assay
IC50
2.50±n/a nM
Citation
 Lapointe, BTFuller, PHGunaydin, HLiu, KSciammetta, NTrotter, BWZhang, HBarr, KJMaclean, JKMolinari, DFSimov, V Substituted pyrazole compounds as RORgammaT inhibitors and uses thereof US Patent  US10221142 Publication Date 3/5/2019 
Target
Name:
Nuclear receptor ROR-gamma
Synonyms:
NR1F3 Nuclear receptor ROR-gamma (RORC) RAR-related orphan receptor C (RORc) RORG RZRG Retinoid-related orphan receptor-gamma (RORc)
Type:
Enzyme Catalytic Domain
Mol. Mass.:
58218.40
Organism:
Homo sapiens (Human)
Description:
P51449
Residue:
518
  
Inhibitor
Name:
BDBM359495
Synonyms:
4-(1-(2-chloro-6- cyclobutylbenzoyl)-4,5,6,7- tetrahydro-1H-indazol-3-yl)-3- fluorobenzoic acid | US10221142, Example 1L
Type:
Small organic molecule
Emp. Form.:
C25H22ClFN2O3
Mol. Mass.:
452.905
SMILES:
OC(=O)c1ccc(-c2nn(C(=O)c3c(Cl)cccc3C3CCC3)c3CCCCc23)c(F)c1
: