Target
Nuclear receptor ROR-gamma
Ligand
BDBM359499
Substrate
Meas. Tech.
Biological Assay
IC50
56.7±n/a nM
Citation
 Lapointe, BTFuller, PHGunaydin, HLiu, KSciammetta, NTrotter, BWZhang, HBarr, KJMaclean, JKMolinari, DFSimov, V Substituted pyrazole compounds as RORgammaT inhibitors and uses thereof US Patent  US10221142 Publication Date 3/5/2019 
Target
Name:
Nuclear receptor ROR-gamma
Synonyms:
NR1F3 Nuclear receptor ROR-gamma (RORC) RAR-related orphan receptor C (RORc) RORG RZRG Retinoid-related orphan receptor-gamma (RORc)
Type:
Enzyme Catalytic Domain
Mol. Mass.:
58218.40
Organism:
Homo sapiens (Human)
Description:
P51449
Residue:
518
  
Inhibitor
Name:
BDBM359499
Synonyms:
US10221142, Example 4A
Type:
Small organic molecule
Emp. Form.:
C22H17ClF4N2O2
Mol. Mass.:
452.829
SMILES:
OC(=O)c1ccc(-c2nn(Cc3c(Cl)cccc3C(F)(F)F)c3CCCCc23)c(F)c1
: