Target
Nuclear receptor ROR-gamma
Ligand
BDBM359595
Substrate
Meas. Tech.
Biological Assay
IC50
6.90±n/a nM
Citation
 Lapointe, BTFuller, PHGunaydin, HLiu, KSciammetta, NTrotter, BWZhang, HBarr, KJMaclean, JKMolinari, DFSimov, V Substituted pyrazole compounds as RORgammaT inhibitors and uses thereof US Patent  US10221142 Publication Date 3/5/2019 
Target
Name:
Nuclear receptor ROR-gamma
Synonyms:
NR1F3 Nuclear receptor ROR-gamma (RORC) RAR-related orphan receptor C (RORc) RORG RZRG Retinoid-related orphan receptor-gamma (RORc)
Type:
Enzyme Catalytic Domain
Mol. Mass.:
58218.40
Organism:
Homo sapiens (Human)
Description:
P51449
Residue:
518
  
Inhibitor
Name:
BDBM359595
Synonyms:
US10221142, Example 27A | US10221142, Example 27B
Type:
Small organic molecule
Emp. Form.:
C28H26ClFN4O5
Mol. Mass.:
552.981
SMILES:
COC1CN(C1)C(=O)C1CNc2c(C1)n(nc2-c1ccc(cc1F)C(O)=O)C(=O)c1c(Cl)cccc1C1CC1
: