Target
Nuclear receptor ROR-gamma
Ligand
BDBM359597
Substrate
Meas. Tech.
Biological Assay
IC50
166±n/a nM
Citation
 Lapointe, BTFuller, PHGunaydin, HLiu, KSciammetta, NTrotter, BWZhang, HBarr, KJMaclean, JKMolinari, DFSimov, V Substituted pyrazole compounds as RORgammaT inhibitors and uses thereof US Patent  US10221142 Publication Date 3/5/2019 
Target
Name:
Nuclear receptor ROR-gamma
Synonyms:
NR1F3 Nuclear receptor ROR-gamma (RORC) RAR-related orphan receptor C (RORc) RORG RZRG Retinoid-related orphan receptor-gamma (RORc)
Type:
Enzyme Catalytic Domain
Mol. Mass.:
58218.40
Organism:
Homo sapiens (Human)
Description:
P51449
Residue:
518
  
Inhibitor
Name:
BDBM359597
Synonyms:
US10221142, Example 28A
Type:
Small organic molecule
Emp. Form.:
C30H25ClF4N4O4
Mol. Mass.:
616.991
SMILES:
Cn1cc(COC2CCc3c(C2)n(nc3-c2ccc(cc2F)C(O)=O)C(=O)c2c(Cl)cccc2C2(CC2)C(F)(F)F)cn1
: