Target
Androgen receptor
Ligand
BDBM18644
Substrate
BDBM10852
Meas. Tech.
Luciferase Reporter Assay
pH
7.8±n/a
IC50
250±n/a nM
Comments
There is 11 +/- 14 % changes from the respective control value of ventral prostate weight after oral administration in 10-week-old male Wistar rats (10 mg/kg/day for 15 days, n = 5 or 6).
Citation
 Kinoyama, ITaniguchi, NToyoshima, ANozawa, EKamikubo, TImamura, MMatsuhisa, ASamizu, KKawanimani, ENiimi, THamada, NKoutoku, HFurutani, TKudoh, MOkada, MOhta, MTsukamoto, S (+)-(2R,5S)-4-[4-cyano-3-(trifluoromethyl)phenyl]-2,5-dimethyl-N-[6-(trifluoromethyl)pyridin-3- yl]piperazine-1-carboxamide (YM580) as an orally potent and peripherally selective nonsteroidal androgen receptor antagonist. J Med Chem 49:716-26 (2006)  
Target
Name:
Androgen receptor
Synonyms:
ANDR_HUMAN Androgen Receptor Androgen receptor/Baculoviral IAP repeat-containing protein 2 Dihydrotestosterone receptor Nuclear receptor subfamily 3 group C member 4
Type:
Receptor
Mol. Mass.:
99185.27
Organism:
Homo sapiens (Human)
Description:
CHO cells were stably transfected with human AR gene.
Residue:
920
  
Inhibitor
Name:
BDBM18644
Synonyms:
(2R,5S)-4-[4-cyano-3-(trifluoromethyl)phenyl]-2,5-dimethyl-N-(5-methylpyridin-3-yl)piperazine-1-carboxamide | N-Arylpiperazine-1-carboxamide Derivative, 21
Type:
Small organic molecule
Emp. Form.:
C21H22F3N5O
Mol. Mass.:
417.4275
SMILES:
C[C@@H]1CN([C@@H](C)CN1C(=O)Nc1cncc(C)c1)c1ccc(C#N)c(c1)C(F)(F)F
:
Substrate