Target
Nuclear receptor ROR-gamma
Ligand
BDBM352638
Substrate
Meas. Tech.
biochemical TR-FRET assay
IC50
2.53±n/a nM
Citation
 Aicher, TDVanHuis, CAThomas, WDMacLean, JKAndresen, BMBarr, KJBienstock, CEAnthony, NJDaniels, MLiu, KLiu, YWhite, CMLapointe, BTSciammetta, NSimov, V Tetrahydronaphthyridine, benzoxazine, aza-benzoxazine and related bicyclic compounds for inhibition of RORgamma activity and the treatment of disease US Patent  US10221146 Publication Date 3/5/2019 
Target
Name:
Nuclear receptor ROR-gamma
Synonyms:
NR1F3 Nuclear receptor ROR-gamma (RORC) RAR-related orphan receptor C (RORc) RORG RZRG Retinoid-related orphan receptor-gamma (RORc)
Type:
Enzyme Catalytic Domain
Mol. Mass.:
58218.40
Organism:
Homo sapiens (Human)
Description:
P51449
Residue:
518
  
Inhibitor
Name:
BDBM352638
Synonyms:
(S)-methyl 3-(2-(6-((tert- butoxycarbonyl) amino)-4-((3- (trifluoromethyl) phenyl)sulfonyl)-3,4- dihydro-2H- benzo[b][1,4]oxazin-2- yl)acetamido) propanoate US9809561, 37AA
Type:
Small organic molecule
Emp. Form.:
C26H30F3N3O8S
Mol. Mass.:
601.592
SMILES:
COC(=O)CCNC(=O)C[C@H]1CN(c2cc(NC(=O)OC(C)(C)C)ccc2O1)S(=O)(=O)c1cccc(c1)C(F)(F)F
: