Target
Nuclear receptor ROR-gamma
Ligand
BDBM352744
Substrate
Meas. Tech.
biochemical TR-FRET assay
IC50
3.42±n/a nM
Citation
 Aicher, TDVanHuis, CAThomas, WDMacLean, JKAndresen, BMBarr, KJBienstock, CEAnthony, NJDaniels, MLiu, KLiu, YWhite, CMLapointe, BTSciammetta, NSimov, V Tetrahydronaphthyridine, benzoxazine, aza-benzoxazine and related bicyclic compounds for inhibition of RORgamma activity and the treatment of disease US Patent  US10221146 Publication Date 3/5/2019 
Target
Name:
Nuclear receptor ROR-gamma
Synonyms:
NR1F3 Nuclear receptor ROR-gamma (RORC) RAR-related orphan receptor C (RORc) RORG RZRG Retinoid-related orphan receptor-gamma (RORc)
Type:
Enzyme Catalytic Domain
Mol. Mass.:
58218.40
Organism:
Homo sapiens (Human)
Description:
P51449
Residue:
518
  
Inhibitor
Name:
BDBM352744
Synonyms:
(R)-1,1,1-trifluoro-2-methylpropan-2-yl (2-(2-(2-oxopyrrolidin-1-yl)ethyl)-4-((3- (trifluoromethyl)phenyl)sulfonyl)-3,4- dihydro-2H-benzo[b][1,4]oxazin-6- yl)carbamate US9809561, 53P
Type:
Small organic molecule
Emp. Form.:
C26H27F6N3O6S
Mol. Mass.:
623.564
SMILES:
CC(C)(OC(=O)Nc1ccc2O[C@H](CCN3CCCC3=O)CN(c2c1)S(=O)(=O)c1cccc(c1)C(F)(F)F)C(F)(F)F
: