Target
Glucocorticoid receptor
Ligand
BDBM18711
Substrate
BDBM18207
Meas. Tech.
Fluorescence Polarization Competitive Binding Assay.
pH
7.4±n/a
Temperature
295.15±n/a K
IC50
804±n/a nM
Citation
 Takahashi, HBekkali, YCapolino, AJGilmore, TGoldrick, SENelson, RMTerenzio, DWang, JZuvela-Jelaska, LProudfoot, JNabozny, GThomson, D Discovery and SAR study of novel dihydroquinoline containing glucocorticoid receptor ligands. Bioorg Med Chem Lett 16:1549-52 (2006)  
Target
Name:
Glucocorticoid receptor
Synonyms:
GCR_HUMAN GRL Glucocorticoid receptor (GRFP) Nuclear receptor subfamily 3 group C member 1
Type:
Enzyme
Mol. Mass.:
85656.87
Organism:
Homo sapiens (Human)
Description:
P04150
Residue:
777
  
Inhibitor
Name:
BDBM18711
Synonyms:
6-(2-methoxyphenyl)-2,2-dimethyl-4-[(phenylsulfanyl)methyl]-1,2-dihydroquinoline | dihydroquinoline compound, 22
Type:
Small organic molecule
Emp. Form.:
C25H25NOS
Mol. Mass.:
387.537
SMILES:
COc1ccccc1-c1ccc2NC(C)(C)C=C(CSc3ccccc3)c2c1
:
Substrate
Name:
BDBM18207
Synonyms:
(1R,2S,10S,11S,13R,14R,15S,17S)-1-fluoro-14,17-dihydroxy-14-(2-hydroxyacetyl)-2,13,15-trimethyltetracyclo[8.7.0.0^{2,7}.0^{11,15}]heptadeca-3,6-dien-5-one US11554172, Compound Dexamethasone dexamethasone (tetramethyl-rhodamine conjugated )
Type:
Steroid
Emp. Form.:
C22H29FO5
Mol. Mass.:
392.4611
SMILES:
[H][C@@]12C[C@@H](C)[C@](O)(C(=O)CO)[C@@]1(C)C[C@H](O)[C@@]1(F)[C@@]2([H])CCC2=CC(=O)C=C[C@]12C
: