Target
Nuclear receptor ROR-gamma
Ligand
BDBM235003
Substrate
Meas. Tech.
Biological Assay
pH
7±n/a
IC50
4855±n/a nM
Comments
extracted
Citation
 Barr, KJBienstock, CEMaclean, JKZhang, HBeresis, RTAnthony, NJLapointe, BTSciammetta, N N-alkylated indole and indazole compounds as RORgammaT inhibitors and uses thereof US Patent  US9556168 Publication Date 1/31/2017 
Target
Name:
Nuclear receptor ROR-gamma
Synonyms:
NR1F3 Nuclear receptor ROR-gamma (RORC) RAR-related orphan receptor C (RORc) RORG RZRG Retinoid-related orphan receptor-gamma (RORc)
Type:
Enzyme Catalytic Domain
Mol. Mass.:
58218.40
Organism:
Homo sapiens (Human)
Description:
P51449
Residue:
518
  
Inhibitor
Name:
BDBM235003
Synonyms:
3-Fluoro-4-[4-fluoro-1-(2,5-difluorobenzyl)-1H-indazol-3-yl]benzoic acid (3A) | US9556168, 3A
Type:
Small organic molecule
Emp. Form.:
C21H12F4N2O2
Mol. Mass.:
400.3258
SMILES:
OC(=O)c1ccc(-c2nn(Cc3cc(F)ccc3F)c3cccc(F)c23)c(F)c1
: