Target
Nuclear receptor ROR-gamma
Ligand
BDBM235021
Substrate
Meas. Tech.
Biological Assay
pH
7±n/a
IC50
13.0±n/a nM
Comments
extracted
Citation
 Barr, KJBienstock, CEMaclean, JKZhang, HBeresis, RTAnthony, NJLapointe, BTSciammetta, N N-alkylated indole and indazole compounds as RORgammaT inhibitors and uses thereof US Patent  US9556168 Publication Date 1/31/2017 
Target
Name:
Nuclear receptor ROR-gamma
Synonyms:
NR1F3 Nuclear receptor ROR-gamma (RORC) RAR-related orphan receptor C (RORc) RORG RZRG Retinoid-related orphan receptor-gamma (RORc)
Type:
Enzyme Catalytic Domain
Mol. Mass.:
58218.40
Organism:
Homo sapiens (Human)
Description:
P51449
Residue:
518
  
Inhibitor
Name:
BDBM235021
Synonyms:
US9556168, 4M
Type:
Small organic molecule
Emp. Form.:
C22H12ClF5N2O3
Mol. Mass.:
482.787
SMILES:
OC(=O)c1cc(F)c(cc1O)-c1nn(Cc2c(Cl)cccc2C(F)(F)F)c2cccc(F)c12
: