Target
Nuclear receptor ROR-gamma
Ligand
BDBM235025
Substrate
Meas. Tech.
Biological Assay
pH
7±n/a
IC50
24.0±n/a nM
Comments
extracted
Citation
 Barr, KJBienstock, CEMaclean, JKZhang, HBeresis, RTAnthony, NJLapointe, BTSciammetta, N N-alkylated indole and indazole compounds as RORgammaT inhibitors and uses thereof US Patent  US9556168 Publication Date 1/31/2017 
Target
Name:
Nuclear receptor ROR-gamma
Synonyms:
NR1F3 Nuclear receptor ROR-gamma (RORC) RAR-related orphan receptor C (RORc) RORG RZRG Retinoid-related orphan receptor-gamma (RORc)
Type:
Enzyme Catalytic Domain
Mol. Mass.:
58218.40
Organism:
Homo sapiens (Human)
Description:
P51449
Residue:
518
  
Inhibitor
Name:
BDBM235025
Synonyms:
4-(1-(2-chloro-6-methylbenzyl)-4-fluoro-1H-indazol-3-yl)-5-fluoro-2-hydroxybenzoic acid (6A) | US9556168, 6A
Type:
Small organic molecule
Emp. Form.:
C22H15ClF2N2O3
Mol. Mass.:
428.816
SMILES:
Cc1cccc(Cl)c1Cn1nc(-c2cc(O)c(cc2F)C(O)=O)c2c(F)cccc12
: