Target
Plasma kallikrein
Ligand
BDBM359637
Substrate
Meas. Tech.
Plasma kallikrein inhibitory activity
IC50
104±n/a nM
Citation
 Edwards, HJEvans, DMMeghani, PNovak, AR Inhibitors of plasma kallikrein US Patent  US10221161 Publication Date 3/5/2019 
Target
Name:
Plasma kallikrein
Synonyms:
Fletcher factor KLKB1 Kallikrein Plasma kallikrein heavy chain Plasma prekallikrein
Type:
Protein
Mol. Mass.:
71391.16
Organism:
Homo sapiens (Human)
Description:
P03952
Residue:
638
  
Inhibitor
Name:
BDBM359637
Synonyms:
N-[(1-Aminoisoquinolin-6-yl)methyl]-2-methyl-5-[(2-methylquinolin-6-yl)methyl]pyridine-3-carboxamide | US10221161, Example 22
Type:
Small organic molecule
Emp. Form.:
C28H25N5O
Mol. Mass.:
447.531
SMILES:
Cc1ccc2cc(Cc3cnc(C)c(c3)C(=O)NCc3ccc4c(N)nccc4c3)ccc2n1
: