Target
Plasma kallikrein
Ligand
BDBM359642
Substrate
Meas. Tech.
Plasma kallikrein inhibitory activity
IC50
1010±n/a nM
Citation
 Edwards, HJEvans, DMMeghani, PNovak, AR Inhibitors of plasma kallikrein US Patent  US10221161 Publication Date 3/5/2019 
Target
Name:
Plasma kallikrein
Synonyms:
Fletcher factor KLKB1 Kallikrein Plasma kallikrein heavy chain Plasma prekallikrein
Type:
Protein
Mol. Mass.:
71391.16
Organism:
Homo sapiens (Human)
Description:
P03952
Residue:
638
  
Inhibitor
Name:
BDBM359642
Synonyms:
N-[(1-Aminoisoquinolin-6-yl)methyl]-5-{[4-(pyrazol-1-yl)phenyl]methyl}pyridine-3-carboxamide US11242333, Example 27
Type:
Small organic molecule
Emp. Form.:
C26H22N6O
Mol. Mass.:
434.4925
SMILES:
Nc1nccc2cc(CNC(=O)c3cncc(Cc4ccc(cc4)-n4cccn4)c3)ccc12
: