Target
Plasma kallikrein
Ligand
BDBM359689
Substrate
Meas. Tech.
Plasma kallikrein inhibitory activity
IC50
51.1±n/a nM
Citation
 Edwards, HJEvans, DMMeghani, PNovak, AR Inhibitors of plasma kallikrein US Patent  US10221161 Publication Date 3/5/2019 
Target
Name:
Plasma kallikrein
Synonyms:
Fletcher factor KLKB1 Kallikrein Plasma kallikrein heavy chain Plasma prekallikrein
Type:
Protein
Mol. Mass.:
71391.16
Organism:
Homo sapiens (Human)
Description:
P03952
Residue:
638
  
Inhibitor
Name:
BDBM359689
Synonyms:
N-[(1-Aminoisoquinolin-6-yl)methyl]-5-({6-[isopropyl(methyl)amino]pyridin-3-yl}methyl)pyridine-3-carboxamide US11242333, Example 73
Type:
Small organic molecule
Emp. Form.:
C26H28N6O
Mol. Mass.:
440.5401
SMILES:
CC(C)N(C)c1ccc(Cc2cncc(c2)C(=O)NCc2ccc3c(N)nccc3c2)cn1
: