Target
Kallikrein-1
Ligand
BDBM359652
Substrate
Meas. Tech.
KLK1 inhibitory activity
IC50
29100±n/a nM
Citation
 Edwards, HJEvans, DMMeghani, PNovak, AR Inhibitors of plasma kallikrein US Patent  US10221161 Publication Date 3/5/2019 
Target
Name:
Kallikrein-1
Synonyms:
KLK1 Kallikrein 1 Kidney/pancreas/salivary gland kallikrein | Tissue kallikrein
Type:
Enzyme
Mol. Mass.:
28874.69
Organism:
Homo sapiens (Human)
Description:
P06870
Residue:
262
  
Inhibitor
Name:
BDBM359652
Synonyms:
N-[(1-Aminoisoquinolin-6-yl)methyl]-5-({4-[(4-methylpyrazol-1-yl)methyl]piperidin-1-yl}methyl)pyridine-3-carboxamide | US10221161, Example 37
Type:
Small organic molecule
Emp. Form.:
C27H31N7O
Mol. Mass.:
469.5813
SMILES:
Cc1cnn(CC2CCN(Cc3cncc(c3)C(=O)NCc3ccc4c(N)nccc4c3)CC2)c1
: