Target
Apelin receptor
Ligand
BDBM270028
Substrate
Meas. Tech.
[35S]GTPgammaS Binding Assay
EC50
25.0±n/a nM
Target
Name:
Apelin receptor
Synonyms:
AGTRL1 APJ_HUMAN Angiotensin receptor-like 1 Apelin receptor (APJ) G-protein coupled receptor HG11
Type:
Enzyme Catalytic Domain
Mol. Mass.:
42664.06
Organism:
Homo sapiens (Human)
Description:
P35414
Residue:
380
  
Inhibitor
Name:
BDBM270028
Synonyms:
(2R,3S)—N-(4-(2,6-dimethoxyphenyl)-5-(3-pyridinyl)-4H-1,2,4-triazol-3-yl)-3-(5-methyl-2-pyrimidinyl)-2-butanesulfonamide US10221162, Example 585.0 | US9845310, Example 585.0
Type:
Small organic molecule
Emp. Form.:
C24H27N7O4S
Mol. Mass.:
509.581
SMILES:
COc1cccc(OC)c1-n1c(NS(=O)(=O)[C@H](C)[C@@H](C)c2ncc(C)cn2)nnc1-c1cccnc1
: