Target
Platelet-derived growth factor receptor beta
Ligand
BDBM139543
Substrate
Meas. Tech.
Kinase Assay
Ki
116±n/a nM
Citation
 Hull, III, CEMalone, TC Method of treating conditions with kinase inhibitors US Patent  US9820989 Publication Date 11/21/2017 
Target
Name:
Platelet-derived growth factor receptor beta
Synonyms:
Beta-type platelet-derived growth factor receptor CD140b antigen PDGF Receptor Substrate PDGFR PDGFR-1 PDGFRB PGFRB_HUMAN Platelet-derived growth factor receptor 1 Platelet-derived growth factor receptor beta (PDGFR-beta) Platelet-derived growth factor receptor beta (PDGFRbeta) | VHL/PDGFRB
Type:
Enzyme
Mol. Mass.:
123922.25
Organism:
Homo sapiens (Human)
Description:
P09619
Residue:
1106
  
Inhibitor
Name:
BDBM139543
Synonyms:
US8889870, 3 US9820989, 3
Type:
Small organic molecule
Emp. Form.:
C21H21N5O
Mol. Mass.:
359.4243
SMILES:
Cc1cccc(NC(=O)c2cccc(c2)N2CCc3nc(N)ncc3C2)c1
: