Target
Vascular endothelial growth factor receptor 2
Ligand
BDBM139559
Substrate
Meas. Tech.
Kinase Assay
Ki
>10000±n/a nM
Citation
 Hull, III, CEMalone, TC Method of treating conditions with kinase inhibitors US Patent  US9820989 Publication Date 11/21/2017 
Target
Name:
Vascular endothelial growth factor receptor 2
Synonyms:
CD_antigen=CD309 Fetal liver kinase 1 (FLK-1) KDR Protein-tyrosine kinase receptor Flk-1 VEGFR-2 VEGFR2 Vascular Endothelial Growth Factor Receptor Kinase 2 Vascular endothelial growth factor receptor 2 (KDR) Vascular endothelial growth factor receptor 2 (VEGFR2) Vascular endothelial growth factor receptor-2 (VEGFR-2)
Type:
Receptor Tyrosine Kinase
Mol. Mass.:
151510.97
Organism:
Homo sapiens (Human)
Description:
P35968
Residue:
1356
  
Inhibitor
Name:
BDBM139559
Synonyms:
US8889870, 19 US9820989, 19
Type:
Small organic molecule
Emp. Form.:
C19H23N5O
Mol. Mass.:
337.4188
SMILES:
Nc1ncc2CN(CCc2n1)c1cccc(c1)C(=O)NC1CCCC1
: