Target
Vascular endothelial growth factor receptor 2
Ligand
BDBM139622
Substrate
Meas. Tech.
Kinase Assay
Ki
54.0±n/a nM
Citation
 Hull, III, CEMalone, TC Method of treating conditions with kinase inhibitors US Patent  US9820989 Publication Date 11/21/2017 
Target
Name:
Vascular endothelial growth factor receptor 2
Synonyms:
CD_antigen=CD309 Fetal liver kinase 1 (FLK-1) KDR Protein-tyrosine kinase receptor Flk-1 VEGFR-2 VEGFR2 Vascular Endothelial Growth Factor Receptor Kinase 2 Vascular endothelial growth factor receptor 2 (KDR) Vascular endothelial growth factor receptor 2 (VEGFR2) Vascular endothelial growth factor receptor-2 (VEGFR-2)
Type:
Receptor Tyrosine Kinase
Mol. Mass.:
151510.97
Organism:
Homo sapiens (Human)
Description:
P35968
Residue:
1356
  
Inhibitor
Name:
BDBM139622
Synonyms:
US8889870, 170 US9820989, 170
Type:
Small organic molecule
Emp. Form.:
C25H25N3O3
Mol. Mass.:
415.4843
SMILES:
CC(C)c1cccc(NC(=O)c2cccc(c2)N2CCc3c(C2)cncc3C(O)=O)c1
: