Target
Fatty-acid amide hydrolase 1 [30-579]
Ligand
BDBM359729
Substrate
Meas. Tech.
Radiometric Assay
IC50
1.90±n/a nM
Citation
 Piomelli, DBandiera, TScarpelli, R Inhibitors of fatty acid amide hydrolase (FAAH) enzyme with improved oral bioavailability and their use as medicaments US Patent  US9822068 Publication Date 11/21/2017 
Target
Name:
Fatty-acid amide hydrolase 1 [30-579]
Synonyms:
Anandamide amidohydrolase 1 Faah Fatty Acid Amide Hydrolase Fatty-acid amide hydrolase (FAAH) Fatty-acid amide hydrolase 1 (FAAH) Oleamide hydrolase 1
Type:
Single-pass membrane protein; homodimer
Mol. Mass.:
60474.00
Organism:
Rattus norvegicus (rat)
Description:
P97612 (aa 30-579)
Residue:
550
  
Inhibitor
Name:
BDBM359729
Synonyms:
US10435355, Example 13 [3-(3-carbamoylphenyl)-2- fluoro-phenyl]N- cyclohexylcarbamate
Type:
Small organic molecule
Emp. Form.:
C20H21FN2O3
Mol. Mass.:
356.3907
SMILES:
NC(=O)c1cccc(c1)-c1cccc(OC(=O)NC2CCCCC2)c1F
: