Target
Bifunctional dihydrofolate reductase-thymidylate synthase [1-238,S58R,S117N]
Ligand
BDBM18785
Substrate
BDBM18044
Meas. Tech.
Inhibitor Screening Using Bacterial System (IC50) and Measurement of Inhibition Constant (Ki)
Ki
1.19±n/a nM
IC50
1980±n/a nM
Citation
 Bunyarataphan, SLeartsakulpanich, UTaweechai, STarnchompoo, BKamchonwongpaisan, SYuthavong, Y Evaluation of the activities of pyrimethamine analogs against Plasmodium vivax and Plasmodium falciparum dihydrofolate reductase-thymidylate synthase using in vitro enzyme inhibition and bacterial complementation assays. Antimicrob Agents Chemother 50:3631-7 (2006)  
Target
Name:
Bifunctional dihydrofolate reductase-thymidylate synthase [1-238,S58R,S117N]
Synonyms:
DRTS_PLAVI Dihydrofolate Reductase-Thymidylate Synthase (DHFR-TS) Mutant SP21
Type:
Enzyme
Mol. Mass.:
27235.37
Organism:
Plasmodium vivax (malaria parasite P. vivax)
Description:
O02604[1-238,S58R,S117N]
Residue:
238
  
Inhibitor
Name:
BDBM18785
Synonyms:
5-(3-chlorophenyl)-6-methylpyrimidine-2,4-diamine P38
Type:
Small organic molecule
Emp. Form.:
C11H11ClN4
Mol. Mass.:
234.685
SMILES:
Cc1nc(N)nc(N)c1-c1cccc(Cl)c1
:
Substrate
Name:
BDBM18044
Synonyms:
(2S)-2-[(4-{[(2-amino-4-oxo-1,4,7,8-tetrahydropteridin-6-yl)methyl]amino}phenyl)formamido]pentanedioic acid dihydrofolic acid
Type:
Small organic molecule
Emp. Form.:
C19H21N7O6
Mol. Mass.:
443.4133
SMILES:
Nc1nc2NCC(CNc3ccc(cc3)C(=O)N[C@@H](CCC(O)=O)C(O)=O)=Nc2c(=O)[nH]1
: