Target
Alpha-1,6-mannosyl-glycoprotein 2-beta-N-acetylglucosaminyltransferase
Ligand
BDBM235192
Substrate
Meas. Tech.
LCMS Assay
IC50
4.00±n/a nM
Citation
 Ahmad, SNegash, LA Dihydropyridinone MGAT2 inhibitors US Patent  US9822074 Publication Date 11/21/2017 
Target
Name:
Alpha-1,6-mannosyl-glycoprotein 2-beta-N-acetylglucosaminyltransferase
Synonyms:
2.4.1.143 GNT-II MGAT2 Mannoside acetylglucosaminyltransferase 2 Monoacylglycerol acyltransferase type 2 (h-MGAT2) h-MGAT2 (human monoacylglycerol acyltransferase type 2)
Type:
Mol. Mass.:
51567.80
Organism:
Homo sapiens (Human)
Description:
Q10469
Residue:
447
  
Inhibitor
Name:
BDBM235192
Synonyms:
US9365558, 15 | US9822074, 15
Type:
Small organic molecule
Emp. Form.:
C23H27F3N2O4S
Mol. Mass.:
484.532
SMILES:
CCCCCCC#C[C@@]1(CC(=C(C(=O)NS(C)(=O)=O)C(=O)N1)c1ccc(C)cc1)C(F)(F)F
: