Target
Lysine-specific histone demethylase 1A
Ligand
BDBM103898
Substrate
Meas. Tech.
LSD1 Histone Demethylase Biochemical Assay
pH
7.5±n/a
IC50
<50±n/a nM
Comments
extracted
Citation
 Wu, LKonkol, LCLajkiewicz, NLu, LXu, MYao, WYu, ZZhang, CHe, C Imidazopyridines and imidazopyrazines as LSD1 inhibitors US Patent  US10047086 Publication Date 8/14/2018 
Target
Name:
Lysine-specific histone demethylase 1A
Synonyms:
AOF2 Flavin-containing amine oxidase domain-containing protein 2 KDM1A KIAA0601 Lysine-specific demethylase 1 (LSD1) Lysine-specific histone demethylase 1 (LSD1)
Type:
Enzyme
Mol. Mass.:
92901.01
Organism:
Homo sapiens (Human)
Description:
O60341
Residue:
852
  
Inhibitor
Name:
BDBM103898
Synonyms:
US10047086, 12 US9695168, 12
Type:
Small organic molecule
Emp. Form.:
C28H25N5O2
Mol. Mass.:
463.5304
SMILES:
CN1C(=O)Cc2cc(ccc12)-c1c(cc(OC[C@@H]2CCNC2)c2cncn12)-c1ccc(cc1)C#N
: