Target
Lysine-specific histone demethylase 1A
Ligand
BDBM105526
Substrate
Meas. Tech.
LSD1 Histone Demethylase Biochemical Assay
pH
7.5±n/a
IC50
<50±n/a nM
Comments
extracted
Citation
 Wu, LKonkol, LCLajkiewicz, NLu, LXu, MYao, WYu, ZZhang, CHe, C Imidazopyridines and imidazopyrazines as LSD1 inhibitors US Patent  US10047086 Publication Date 8/14/2018 
Target
Name:
Lysine-specific histone demethylase 1A
Synonyms:
AOF2 Flavin-containing amine oxidase domain-containing protein 2 KDM1A KIAA0601 Lysine-specific demethylase 1 (LSD1) Lysine-specific histone demethylase 1 (LSD1)
Type:
Enzyme
Mol. Mass.:
92901.01
Organism:
Homo sapiens (Human)
Description:
O60341
Residue:
852
  
Inhibitor
Name:
BDBM105526
Synonyms:
US10047086, 79 US9695168, 79
Type:
Small organic molecule
Emp. Form.:
C29H30N4O2
Mol. Mass.:
466.5741
SMILES:
CN1CCC[C@@H](COc2cc(-c3ccc(cc3)C#N)c(-c3ccc(CO)c(C)c3)n3cncc23)C1
: