Target
Lysine-specific histone demethylase 1A
Ligand
BDBM105897
Substrate
Meas. Tech.
LSD1 Histone Demethylase Biochemical Assay
pH
7.5±n/a
IC50
300±n/a nM
Comments
extracted
Citation
 Wu, LKonkol, LCLajkiewicz, NLu, LXu, MYao, WYu, ZZhang, CHe, C Imidazopyridines and imidazopyrazines as LSD1 inhibitors US Patent  US10047086 Publication Date 8/14/2018 
Target
Name:
Lysine-specific histone demethylase 1A
Synonyms:
AOF2 Flavin-containing amine oxidase domain-containing protein 2 KDM1A KIAA0601 Lysine-specific demethylase 1 (LSD1) Lysine-specific histone demethylase 1 (LSD1)
Type:
Enzyme
Mol. Mass.:
92901.01
Organism:
Homo sapiens (Human)
Description:
O60341
Residue:
852
  
Inhibitor
Name:
BDBM105897
Synonyms:
US10047086, 141 US9695168, 141
Type:
Small organic molecule
Emp. Form.:
C27H28N8O
Mol. Mass.:
480.5642
SMILES:
CNC(=O)c1ccc(cn1)-c1c(nc(N2CCC(CC2)N(C)C)c2cncn12)-c1ccc(cc1)C#N
: