Target
Lysine-specific histone demethylase 1A
Ligand
BDBM105905
Substrate
Meas. Tech.
LSD1 Histone Demethylase Biochemical Assay
pH
7.5±n/a
IC50
<50±n/a nM
Comments
extracted
Citation
 Wu, LKonkol, LCLajkiewicz, NLu, LXu, MYao, WYu, ZZhang, CHe, C Imidazopyridines and imidazopyrazines as LSD1 inhibitors US Patent  US10047086 Publication Date 8/14/2018 
Target
Name:
Lysine-specific histone demethylase 1A
Synonyms:
AOF2 Flavin-containing amine oxidase domain-containing protein 2 KDM1A KIAA0601 Lysine-specific demethylase 1 (LSD1) Lysine-specific histone demethylase 1 (LSD1)
Type:
Enzyme
Mol. Mass.:
92901.01
Organism:
Homo sapiens (Human)
Description:
O60341
Residue:
852
  
Inhibitor
Name:
BDBM105905
Synonyms:
US10047086, 143 US9695168, 143
Type:
Small organic molecule
Emp. Form.:
C29H28F2N8
Mol. Mass.:
526.583
SMILES:
CN(C)C1CCN(CC1)c1nc(-c2ccc(cc2)C#N)c(-c2ccc3n(C)c(nc3c2)C(F)F)n2cncc12
: