Target
Bifunctional dihydrofolate reductase-thymidylate synthase
Ligand
BDBM18792
Substrate
BDBM18044
Meas. Tech.
Antimalarial Testing In Vitro (IC50) and Measurement of Inhibition Constant (Ki)
pH
7±n/a
Temperature
298.15±n/a K
Ki
0.3±0 nM
IC50
37±12 nM
Citation
 Yuvaniyama, JChitnumsub, PKamchonwongpaisan, SVanichtanankul, JSirawaraporn, WTaylor, PWalkinshaw, MDYuthavong, Y Insights into antifolate resistance from malarial DHFR-TS structures. Nat Struct Biol 10:257-65 (2003)  
Target
Name:
Bifunctional dihydrofolate reductase-thymidylate synthase
Synonyms:
Bifunctional dihydrofolate reductase-thymidylate synthase (DHFR-TS) PfDHFR-TS
Type:
Enzyme
Mol. Mass.:
71741.43
Organism:
Plasmodium falciparum (isolate K1 / Thailand)
Description:
PfDHFR-TS wild-type (TM4/8.2) was expressed and purified from E. coli.
Residue:
608
  
Inhibitor
Name:
BDBM18792
Synonyms:
1-(4-chlorophenyl)-6,6-dimethyl-1,6-dihydro-1,3,5-triazine-2,4-diamine Chlorazin | Cycloguanil
Type:
Small organic molecule
Emp. Form.:
C11H14ClN5
Mol. Mass.:
251.715
SMILES:
CC1(C)N=C(N)N=C(N)N1c1ccc(Cl)cc1
:
Substrate
Name:
BDBM18044
Synonyms:
(2S)-2-[(4-{[(2-amino-4-oxo-1,4,7,8-tetrahydropteridin-6-yl)methyl]amino}phenyl)formamido]pentanedioic acid dihydrofolic acid
Type:
Small organic molecule
Emp. Form.:
C19H21N7O6
Mol. Mass.:
443.4133
SMILES:
Nc1nc2NCC(CNc3ccc(cc3)C(=O)N[C@@H](CCC(O)=O)C(O)=O)=Nc2c(=O)[nH]1
: