Target
Coagulation factor XI
Ligand
BDBM246272
Substrate
Meas. Tech.
Inhibition Assay
IC50
3.00±n/a nM
Citation
 Röhrig, SHillisch, AStrassburger, JHeitmeier, SSchmidt, MVSchlemmer, KTersteegen, ABuchmüller, AGerdes, CSchäfer, MKinzel, TTeller, HSchirok, HKlar, JNunez, EJ Substituted oxopyridine derivatives and use thereof in the treatment of cardiovascular disorders US Patent  US9822102 Publication Date 11/21/2017 
Target
Name:
Coagulation factor XI
Synonyms:
Coagulation factor XIa Coagulation factor XIa light chain FA11_HUMAN Factor XIa PTA | Plasma thromboplastin antecedent
Type:
Enzyme
Mol. Mass.:
70130.58
Organism:
Homo sapiens (Human)
Description:
P03951
Residue:
625
  
Inhibitor
Name:
BDBM246272
Synonyms:
US10183932, Example 179 US9434690, 179 | US9822102, Example 179
Type:
Small organic molecule
Emp. Form.:
C24H19ClFN3O5
Mol. Mass.:
483.876
SMILES:
CCC(C(=O)Nc1ccc(C(O)=O)c(F)c1)n1cc(OC)c(cc1=O)-c1cc(Cl)ccc1C#N
: