Target
Dihydrofolate reductase
Ligand
BDBM18802
Substrate
BDBM18044
Meas. Tech.
Dihydrofolate Reductase (DHFR) Assay
pH
7.4±n/a
Temperature
303.15±n/a K
IC50
>26000±n/a nM
Citation
 Gangjee, AJain, HDPhan, JLin, XSong, XMcGuire, JJKisliuk, RL Dual inhibitors of thymidylate synthase and dihydrofolate reductase as antitumor agents: design, synthesis, and biological evaluation of classical and nonclassical pyrrolo[2,3-d]pyrimidine antifolates(1). J Med Chem 49:1055-65 (2006)  
Target
Name:
Dihydrofolate reductase
Synonyms:
DHFR Dihydrofolate reductase (DHFR) | Tetrahydrofolate dehydrogenase
Type:
Enzyme
Mol. Mass.:
21453.99
Organism:
Homo sapiens (Human)
Description:
Recombinant human DHFR.
Residue:
187
  
Inhibitor
Name:
BDBM18802
Synonyms:
2-amino-5-[(4-bromophenyl)sulfanyl]-6-ethyl-3H,4H,7H-pyrrolo[2,3-d]pyrimidin-4-one | Pyrrolo[2,3-d]pyrimidine analogue, 9
Type:
Small organic molecule
Emp. Form.:
C14H13BrN4OS
Mol. Mass.:
365.248
SMILES:
CCc1[nH]c2nc(N)[nH]c(=O)c2c1Sc1ccc(Br)cc1
:
Substrate
Name:
BDBM18044
Synonyms:
(2S)-2-[(4-{[(2-amino-4-oxo-1,4,7,8-tetrahydropteridin-6-yl)methyl]amino}phenyl)formamido]pentanedioic acid dihydrofolic acid
Type:
Small organic molecule
Emp. Form.:
C19H21N7O6
Mol. Mass.:
443.4133
SMILES:
Nc1nc2NCC(CNc3ccc(cc3)C(=O)N[C@@H](CCC(O)=O)C(O)=O)=Nc2c(=O)[nH]1
: