Target
Histone-lysine N-methyltransferase EZH2
Ligand
BDBM359776
Substrate
Meas. Tech.
Biological Assay
IC50
>1000±n/a nM
Citation
 Seitz, SPMarkwalder, JAPurandare, AV Inhibitors of lysine methyl transferase US Patent  US9822103 Publication Date 11/21/2017 
Target
Name:
Histone-lysine N-methyltransferase EZH2
Synonyms:
ENX-1 EZH2_HUMAN Histone-lysine N-methyltransferase EZH2 Lysine N-methyltransferase 6
Type:
Protein
Mol. Mass.:
85367.84
Organism:
Homo sapiens (Human)
Description:
Q15910
Residue:
746
  
Inhibitor
Name:
BDBM359776
Synonyms:
9-Bromo-N-((4,6-dimethyl-2-oxo-1,2-dihydropyridin-3-yl)methyl)-4-methyl-2,3,4,5-tetrahydrobenzo[b]oxepine-7-carboxamide | US9822103, Example 45
Type:
Small organic molecule
Emp. Form.:
C20H23BrN2O3
Mol. Mass.:
419.312
SMILES:
CC1COCc2c(Br)cc(cc2C1)C(=O)NCc1c(C)cc(C)[nH]c1=O
: