Target
Histone-lysine N-methyltransferase EZH2
Ligand
BDBM359819
Substrate
Meas. Tech.
Biological Assay
IC50
>1000±n/a nM
Citation
 Seitz, SPMarkwalder, JAPurandare, AV Inhibitors of lysine methyl transferase US Patent  US9822103 Publication Date 11/21/2017 
Target
Name:
Histone-lysine N-methyltransferase EZH2
Synonyms:
ENX-1 EZH2_HUMAN Histone-lysine N-methyltransferase EZH2 Lysine N-methyltransferase 6
Type:
Protein
Mol. Mass.:
85367.84
Organism:
Homo sapiens (Human)
Description:
Q15910
Residue:
746
  
Inhibitor
Name:
BDBM359819
Synonyms:
US9822103, Example 73 | tert-Butyl 4-(5-(5-(((4,6-dimethyl-2-oxo-1,2-dihydropyridin-3-yl)methyl)carbamoyl)-3H-spiro[benzofuran-2,1′-cyclopentan]-7-yl)pyrimidin-2-yl)piperazine-1-carboxylate
Type:
Small organic molecule
Emp. Form.:
C34H42N6O5
Mol. Mass.:
614.7345
SMILES:
Cc1cc(C)c(CNC(=O)c2cc3CC4(CCCC4)Oc3c(c2)-c2cnc(nc2)N2CCN(CC2)C(=O)OC(C)(C)C)c(=O)[nH]1
: