Target
Thyroid hormone receptor beta [209-461]
Ligand
BDBM18818
Substrate
Peptide SRC2-2
Meas. Tech.
Fluorescence Polarization (FP) Competition Assay
IC50
2700±n/a nM
Citation
 Arnold, LAKosinski, AEstebanez-Perpina, EFletterick, RJGuy, RK Inhibitors of the Interaction of a Thyroid Hormone Receptor and Coactivators: Preliminary Structure-Activity Relationships. J Med Chem 50:5269-5280 (2007)  
Target
Name:
Thyroid hormone receptor beta [209-461]
Synonyms:
ERBA2 THB_HUMAN THRB | Thyroid Hormone Receptor (TR-beta)
Type:
Ligand-Binding Domain
Mol. Mass.:
28584.77
Organism:
Homo sapiens (Human)
Description:
The hTRbeta LBD (His6 T209-D461) was cloned and expressed in E. coli.
Residue:
253
  
Inhibitor
Name:
BDBM18818
Synonyms:
1-(4-hexylphenyl)-3-(morpholin-4-yl)propan-1-one | beta-Aminophenylketone, 3e
Type:
Small organic molecule
Emp. Form.:
C19H29NO2
Mol. Mass.:
303.4391
SMILES:
CCCCCCc1ccc(cc1)C(=O)CCN1CCOCC1
:
Substrate
Name:
Peptide SRC2-2
Synonyms:
Type:
Peptide
Mol. Mass.:
2334.76
Organism:
Description:
The peptide is labeled with 5-iodoacetamidofluorescien.
Residue:
20