Target
Thyroid hormone receptor beta [209-461]
Ligand
BDBM18836
Substrate
Peptide SRC2-2
Meas. Tech.
Fluorescence Polarization (FP) Competition Assay
IC50
43500±n/a nM
Citation
 Arnold, LAKosinski, AEstebanez-Perpina, EFletterick, RJGuy, RK Inhibitors of the Interaction of a Thyroid Hormone Receptor and Coactivators: Preliminary Structure-Activity Relationships. J Med Chem 50:5269-5280 (2007)  
Target
Name:
Thyroid hormone receptor beta [209-461]
Synonyms:
ERBA2 THB_HUMAN THRB | Thyroid Hormone Receptor (TR-beta)
Type:
Ligand-Binding Domain
Mol. Mass.:
28584.77
Organism:
Homo sapiens (Human)
Description:
The hTRbeta LBD (His6 T209-D461) was cloned and expressed in E. coli.
Residue:
253
  
Inhibitor
Name:
BDBM18836
Synonyms:
4-(2-methylbutan-2-yl)phenyl prop-2-enoate | Substituted Acrylate, 6d
Type:
Small organic molecule
Emp. Form.:
C14H18O2
Mol. Mass.:
218.2915
SMILES:
CCC(C)(C)c1ccc(OC(=O)C=C)cc1
:
Substrate
Name:
Peptide SRC2-2
Synonyms:
Type:
Peptide
Mol. Mass.:
2334.76
Organism:
Description:
The peptide is labeled with 5-iodoacetamidofluorescien.
Residue:
20