Target
Thyroid hormone receptor beta [209-461]
Ligand
BDBM18845
Substrate
Peptide SRC2-2
Meas. Tech.
Fluorescence Polarization (FP) Competition Assay
IC50
69800±n/a nM
Citation
 Arnold, LAKosinski, AEstebanez-Perpina, EFletterick, RJGuy, RK Inhibitors of the Interaction of a Thyroid Hormone Receptor and Coactivators: Preliminary Structure-Activity Relationships. J Med Chem 50:5269-5280 (2007)  
Target
Name:
Thyroid hormone receptor beta [209-461]
Synonyms:
ERBA2 THB_HUMAN THRB | Thyroid Hormone Receptor (TR-beta)
Type:
Ligand-Binding Domain
Mol. Mass.:
28584.77
Organism:
Homo sapiens (Human)
Description:
The hTRbeta LBD (His6 T209-D461) was cloned and expressed in E. coli.
Residue:
253
  
Inhibitor
Name:
BDBM18845
Synonyms:
5,6,7,8-tetrahydronaphthalen-2-yl prop-2-enoate | Substituted Acrylate, 6m
Type:
Small organic molecule
Emp. Form.:
C13H14O2
Mol. Mass.:
202.2491
SMILES:
C=CC(=O)Oc1ccc2CCCCc2c1
:
Substrate
Name:
Peptide SRC2-2
Synonyms:
Type:
Peptide
Mol. Mass.:
2334.76
Organism:
Description:
The peptide is labeled with 5-iodoacetamidofluorescien.
Residue:
20