Target
Tyrosine-protein kinase BTK
Ligand
BDBM359873
Substrate
Meas. Tech.
KinaseProfiler Radiometric Protein Kinase Assay
EC50
<100±n/a nM
Citation
 Laurent, ARose, Y Protein kinase inhibitors US Patent  US9822120 Publication Date 11/21/2017 
Target
Name:
Tyrosine-protein kinase BTK
Synonyms:
AGMX1 Agammaglobulinaemia tyrosine kinase B cell progenitor kinase BPK BTK_HUMAN Tyrosine Kinase BTK Tyrosine-protein kinase BTK (BTK)
Type:
Enzyme
Mol. Mass.:
76289.95
Organism:
Homo sapiens (Human)
Description:
Q06187
Residue:
659
  
Inhibitor
Name:
BDBM359873
Synonyms:
US9822120, Compound 29
Type:
Small organic molecule
Emp. Form.:
C28H25FN6O3
Mol. Mass.:
512.5349
SMILES:
Cc1ncc(COc2cc(F)cc(Oc3ccc(cc3)-c3nc([C@@H]4C[C@H](O)C4)n4ccnc(N)c34)c2)cn1
: