Target
Tyrosine-protein kinase BTK
Ligand
BDBM359849
Substrate
Meas. Tech.
Kinase Inhibition Assay
EC50
<100±n/a nM
Citation
 Laurent, ARose, Y Protein kinase inhibitors US Patent  US9822120 Publication Date 11/21/2017 
Target
Name:
Tyrosine-protein kinase BTK
Synonyms:
AGMX1 Agammaglobulinaemia tyrosine kinase B cell progenitor kinase BPK BTK_HUMAN Tyrosine Kinase BTK Tyrosine-protein kinase BTK (BTK)
Type:
Enzyme
Mol. Mass.:
76289.95
Organism:
Homo sapiens (Human)
Description:
Q06187
Residue:
659
  
Inhibitor
Name:
BDBM359849
Synonyms:
US9822120, Compound 3
Type:
Small organic molecule
Emp. Form.:
C28H26FN5O2
Mol. Mass.:
483.5367
SMILES:
CC(C)c1nc(-c2ccc(Oc3cc(F)cc(OCc4ccc(C)nc4)c3)cc2)c2c(N)nccn12
: