Target
Tyrosine-protein kinase BTK
Ligand
BDBM359864
Substrate
Meas. Tech.
Kinase Inhibition Assay
EC50
550±n/a nM
Citation
 Laurent, ARose, Y Protein kinase inhibitors US Patent  US9822120 Publication Date 11/21/2017 
Target
Name:
Tyrosine-protein kinase BTK
Synonyms:
AGMX1 Agammaglobulinaemia tyrosine kinase B cell progenitor kinase BPK BTK_HUMAN Tyrosine Kinase BTK Tyrosine-protein kinase BTK (BTK)
Type:
Enzyme
Mol. Mass.:
76289.95
Organism:
Homo sapiens (Human)
Description:
Q06187
Residue:
659
  
Inhibitor
Name:
BDBM359864
Synonyms:
US9822120, Compound 18
Type:
Small organic molecule
Emp. Form.:
C30H30FN7O2
Mol. Mass.:
539.6033
SMILES:
Cc1ncc(COc2cc(F)cc(Oc3ccc(cc3)-c3nc(CCN4CCCC4)n4ccnc(N)c34)c2)cn1
: