Target
Serine/threonine-protein kinase pim-1
Ligand
BDBM359887
Substrate
Meas. Tech.
Enzyme Assay
IC50
<10±n/a nM
Citation
 Vechorkin, OLi, Y Bicyclic heteroaromatic carboxamide compounds useful as Pim kinase inhibitors US Patent  US9822124 Publication Date 11/21/2017 
Target
Name:
Serine/threonine-protein kinase pim-1
Synonyms:
PIM-1 Kinase PIM1_HUMAN Serine/threonine-protein kinase (PIM1) Serine/threonine-protein kinase PIM1 | Serine/threonine-protein kinase pim-1 (PIM1)
Type:
Protein
Mol. Mass.:
35681.82
Organism:
Homo sapiens (Human)
Description:
P11309
Residue:
313
  
Inhibitor
Name:
BDBM359887
Synonyms:
N-(4-((3R,4R,5S)-3-Amino-4-hydroxy-5-methylpiperidin-1-yl)pyridin-3-yl)-2-(2,6-difluorophenyl)furo[3,2-b]pyridine-5-carboxamide | US9822124, Example 8
Type:
Small organic molecule
Emp. Form.:
C25H23F2N5O3
Mol. Mass.:
479.4786
SMILES:
C[C@H]1CN(C[C@@H](N)[C@@H]1O)c1ccncc1NC(=O)c1ccc2oc(cc2n1)-c1c(F)cccc1F
: