Target
Serine/threonine-protein kinase pim-1
Ligand
BDBM359895
Substrate
Meas. Tech.
Enzyme Assay
IC50
<10±n/a nM
Citation
 Vechorkin, OLi, Y Bicyclic heteroaromatic carboxamide compounds useful as Pim kinase inhibitors US Patent  US9822124 Publication Date 11/21/2017 
Target
Name:
Serine/threonine-protein kinase pim-1
Synonyms:
PIM-1 Kinase PIM1_HUMAN Serine/threonine-protein kinase (PIM1) Serine/threonine-protein kinase PIM1 | Serine/threonine-protein kinase pim-1 (PIM1)
Type:
Protein
Mol. Mass.:
35681.82
Organism:
Homo sapiens (Human)
Description:
P11309
Residue:
313
  
Inhibitor
Name:
BDBM359895
Synonyms:
N-(4-((3R,4R,5S)-3-Amino-4-hydroxy-5-methylpiperidin-1-yl)pyridin-3-yl)-3-ethylfuro[3,2-b]pyridine-5-carboxamide | US9822124, Example 15
Type:
Small organic molecule
Emp. Form.:
C21H25N5O3
Mol. Mass.:
395.4549
SMILES:
CCc1coc2ccc(nc12)C(=O)Nc1cnccc1N1C[C@H](C)[C@@H](O)[C@H](N)C1
: