Target
Serine/threonine-protein kinase pim-3
Ligand
BDBM359903
Substrate
Meas. Tech.
Enzyme Assay
IC50
<10±n/a nM
Citation
 Vechorkin, OLi, Y Bicyclic heteroaromatic carboxamide compounds useful as Pim kinase inhibitors US Patent  US9822124 Publication Date 11/21/2017 
Target
Name:
Serine/threonine-protein kinase pim-3
Synonyms:
PIM3 Serine/threonine-protein kinase pim-3 (PIM3)
Type:
Protein
Mol. Mass.:
35888.19
Organism:
Homo sapiens (Human)
Description:
Q86V86
Residue:
326
  
Inhibitor
Name:
BDBM359903
Synonyms:
N-(4-((3S,5R)-3-Amino-5-methylpiperidin-1-yl)pyridin-3-yl)-3-(2,6-difluoro-3-methoxyphenyl)furo[3,2-b]pyridine-5-carboxamide | US9822124, Example 22
Type:
Small organic molecule
Emp. Form.:
C26H25F2N5O3
Mol. Mass.:
493.5052
SMILES:
COc1ccc(F)c(-c2coc3ccc(nc23)C(=O)Nc2cnccc2N2C[C@H](C)C[C@H](N)C2)c1F
: