Target
Serine/threonine-protein kinase pim-1
Ligand
BDBM359908
Substrate
Meas. Tech.
Enzyme Assay
IC50
<10±n/a nM
Citation
 Vechorkin, OLi, Y Bicyclic heteroaromatic carboxamide compounds useful as Pim kinase inhibitors US Patent  US9822124 Publication Date 11/21/2017 
Target
Name:
Serine/threonine-protein kinase pim-1
Synonyms:
PIM-1 Kinase PIM1_HUMAN Serine/threonine-protein kinase (PIM1) Serine/threonine-protein kinase PIM1 | Serine/threonine-protein kinase pim-1 (PIM1)
Type:
Protein
Mol. Mass.:
35681.82
Organism:
Homo sapiens (Human)
Description:
P11309
Residue:
313
  
Inhibitor
Name:
BDBM359908
Synonyms:
N-(4-((3S,5R)-3-Amino-5-methylpiperidin-1-yl)pyridin-3-yl)-3-(5-cyanopyridin-3-yl)furo[3,2-b]pyridine-5-carboxamide | US9822124, Example 26
Type:
Small organic molecule
Emp. Form.:
C25H23N7O2
Mol. Mass.:
453.4958
SMILES:
C[C@@H]1C[C@H](N)CN(C1)c1ccncc1NC(=O)c1ccc2occ(-c3cncc(c3)C#N)c2n1
: