Target
Serine/threonine-protein kinase pim-1
Ligand
BDBM359974
Substrate
Meas. Tech.
Enzyme Assay
IC50
<10±n/a nM
Citation
 Vechorkin, OLi, Y Bicyclic heteroaromatic carboxamide compounds useful as Pim kinase inhibitors US Patent  US9822124 Publication Date 11/21/2017 
Target
Name:
Serine/threonine-protein kinase pim-1
Synonyms:
PIM-1 Kinase PIM1_HUMAN Serine/threonine-protein kinase (PIM1) Serine/threonine-protein kinase PIM1 | Serine/threonine-protein kinase pim-1 (PIM1)
Type:
Protein
Mol. Mass.:
35681.82
Organism:
Homo sapiens (Human)
Description:
P11309
Residue:
313
  
Inhibitor
Name:
BDBM359974
Synonyms:
N-{4-[(3R,4R,5S)-3-Amino-4-hydroxy-5-methylpiperidin-1-yl]pyridin-3-yl}-2-(cis-2-methylcyclopropyl)furo[2,3-b]pyridine-6-carboxamide (Example 73) and N-{4-[(3R,4R,5S)-3-Amino-4-hydroxy-5-methylpiperidin-1-yl]pyridin-3-yl}-2-(trans-2-methylcyclopropyl)furo[2,3-b]pyridine-6-carboxamide (Example 74) | US9822124, Example 73
Type:
Small organic molecule
Emp. Form.:
C23H27N5O3
Mol. Mass.:
421.4922
SMILES:
CC1CC1c1cc2ccc(nc2o1)C(=O)Nc1cnccc1N1C[C@H](C)[C@@H](O)[C@H](N)C1
: