Target
Muscarinic acetylcholine receptor M3
Ligand
BDBM360028
Substrate
Meas. Tech.
Binding Assay
Ki
4.42±n/a nM
Citation
 Kim, SIm, WCho, CChoi, SPark, JKim, MChoi, SLee, MCho, K Biphenyl derivatives and methods for preparing same US Patent  US9828339 Publication Date 11/28/2017 
Target
Name:
Muscarinic acetylcholine receptor M3
Synonyms:
ACM3_HUMAN Cholinergic, muscarinic M3 Muscarinic receptor M3 | RecName: Full=Muscarinic acetylcholine receptor M3
Type:
Enzyme
Mol. Mass.:
66151.03
Organism:
Homo sapiens (Human)
Description:
P20309
Residue:
590
  
Inhibitor
Name:
BDBM360028
Synonyms:
4'-Fluoro-[1,1'- | US9828339, Example 1
Type:
Small organic molecule
Emp. Form.:
C20H23FN2O2
Mol. Mass.:
342.4072
SMILES:
CN1CCCC1CCOC(=O)Nc1ccccc1-c1ccc(F)cc1
: