Target
Muscarinic acetylcholine receptor M3
Ligand
BDBM360227
Substrate
Meas. Tech.
Binding Assay
Ki
1.12±n/a nM
Citation
 Kim, SIm, WCho, CChoi, SPark, JKim, MChoi, SLee, MCho, K Biphenyl derivatives and methods for preparing same US Patent  US9828339 Publication Date 11/28/2017 
Target
Name:
Muscarinic acetylcholine receptor M3
Synonyms:
ACM3_HUMAN Cholinergic, muscarinic M3 Muscarinic receptor M3 | RecName: Full=Muscarinic acetylcholine receptor M3
Type:
Enzyme
Mol. Mass.:
66151.03
Organism:
Homo sapiens (Human)
Description:
P20309
Residue:
590
  
Inhibitor
Name:
BDBM360227
Synonyms:
(R)-(1-methyl- | US9828339, Example 143
Type:
Small organic molecule
Emp. Form.:
C19H19ClF2N2O2
Mol. Mass.:
380.816
SMILES:
CN1CC[C@@H](COC(=O)Nc2ccc(F)cc2-c2ccc(F)c(Cl)c2)C1
: