Target
Thyroid hormone receptor alpha
Ligand
BDBM18862
Substrate
BDBM18860
Meas. Tech.
TRalpha-Binding Assay.
pH
7±n/a
Temperature
277.15±n/a K
IC50
0.14±n/a nM
Citation
 Ye, LLi, YLMellström, KMellin, CBladh, LGKoehler, KGarg, NGarcia Collazo, AMLitten, CHusman, BPersson, KLjunggren, JGrover, GSleph, PGGeorge, RMalm, J Thyroid receptor ligands. 1. Agonist ligands selective for the thyroid receptor beta1. J Med Chem 46:1580-8 (2003)  
Target
Name:
Thyroid hormone receptor alpha
Synonyms:
C-erbA-alpha EAR7 NR1A1 THA_HUMAN THRA1 Thyroid Hormone Receptor (TR-alpha) Thyroid hormone receptor alpha c-erbA-1
Type:
Receptor
Mol. Mass.:
54818.00
Organism:
Homo sapiens (Human)
Description:
Recombinant hThR was obtained from nuclear extracts from SF9 cells infected with baculovirus vectors encoding for ThRalpha 1.
Residue:
490
  
Inhibitor
Name:
BDBM18862
Synonyms:
2-[4-(4-hydroxy-3-iodophenoxy)-3,5-diiodophenyl]acetic acid TRIAC Triiodothyroacetic acid, 3 | US10322118, Entry Tiratricol
Type:
Small organic molecule
Emp. Form.:
C14H9I3O4
Mol. Mass.:
621.9323
SMILES:
OC(=O)Cc1cc(I)c(Oc2ccc(O)c(I)c2)c(I)c1
:
Substrate
Name:
BDBM18860
Synonyms:
(2R)-2-amino-3-[4-(4-hydroxy-3-iodophenoxy)-3,5-diiodophenyl]propanoic acid 3,5,3'-triiodo-L-thyronine (T3) Triiodothyronine US10544075, Compound T3 liothyronine | triothyrone
Type:
Hormone
Emp. Form.:
C15H12I3NO4
Mol. Mass.:
650.9735
SMILES:
N[C@@H](Cc1cc(I)c(Oc2ccc(O)c(I)c2)c(I)c1)C(O)=O
: