Target
Envelope glycoprotein gp160
Ligand
BDBM235040
Substrate
Meas. Tech.
HIV cell culture assay
EC50
>100±n/a nM
Citation
 Chen, JChen, YMeanwell, NARegueiro-Ren, ASin, NSit, S C17-aryl substituted betulinic acid analogs US Patent  US10047118 Publication Date 8/14/2018 
Target
Name:
Envelope glycoprotein gp160
Synonyms:
ENV_HV1H2 Envelope surface glycoprotein gp160, precursor env
Type:
Mol. Mass.:
97241.93
Organism:
Human immunodeficiency virus type 1 group M subtype B (isolate HXB2)
Description:
Residue:
856
  
Inhibitor
Name:
BDBM235040
Synonyms:
4-((1R,3aS,5aR,5bR,7aR,11aS,11bR,13aR,13bR)-5a,5b,8,8,11a-pentamethyl-3a-(1-methyl-1H-1,2,4-triazol-5-yl)-1-(prop-1-en-2-yl)-2,3,3a,4,5,5a,5b,6,7,7a,8,11,11a,11b,12,13,13a,13b-octadecahydro-1H-cyclopenta[a]chrysen-9-yl)benzoic acid | US10047118, 7
Type:
Small organic molecule
Emp. Form.:
C39H53N3O2
Mol. Mass.:
595.857
SMILES:
CC(=C)[C@@H]1CC[C@@]2(CC[C@]3(C)[C@H](CC[C@@H]4[C@@]5(C)CC=C(c6ccc(cc6)C(O)=O)C(C)(C)[C@@H]5CC[C@@]34C)[C@@H]12)c1ncnn1C
: