Target
Thyroid hormone receptor beta
Ligand
BDBM18893
Substrate
BDBM18860
Meas. Tech.
TRbeta-Binding Assay
pH
7±n/a
Temperature
277.15±n/a K
IC50
190±n/a nM
Citation
 Malm, JGordon, SBrandt, PCarlsson, BAgback, PBäckbro Saeidi, ASandberg, J Thyroid receptor ligands. Part 7: Indirect antagonists of the thyroid hormone receptor with improved affinity. Bioorg Med Chem Lett 17:2018-21 (2007)  
Target
Name:
Thyroid hormone receptor beta
Synonyms:
ERBA2 Nuclear receptor subfamily 1 group A member 2 THR1 c-erbA-2 | c-erbA-beta
Type:
Receptor
Mol. Mass.:
52793.62
Organism:
Homo sapiens (Human)
Description:
Recombinant hThR was obtained from nuclear extracts from SF9 cells infected with baculovirus vectors encoding for ThRbeta 1.
Residue:
461
  
Inhibitor
Name:
BDBM18893
Synonyms:
3-{3,5-dibromo-4-[(3-chlorophenyl)methoxy]phenyl}propanoic acid | benzyl derivative, 11e
Type:
Small organic molecule
Emp. Form.:
C16H13Br2ClO3
Mol. Mass.:
448.534
SMILES:
OC(=O)CCc1cc(Br)c(OCc2cccc(Cl)c2)c(Br)c1
:
Substrate
Name:
BDBM18860
Synonyms:
(2R)-2-amino-3-[4-(4-hydroxy-3-iodophenoxy)-3,5-diiodophenyl]propanoic acid 3,5,3'-triiodo-L-thyronine (T3) Triiodothyronine US10544075, Compound T3 liothyronine | triothyrone
Type:
Hormone
Emp. Form.:
C15H12I3NO4
Mol. Mass.:
650.9735
SMILES:
N[C@@H](Cc1cc(I)c(Oc2ccc(O)c(I)c2)c(I)c1)C(O)=O
: