Target
Thyroid hormone receptor alpha
Ligand
BDBM18932
Substrate
BDBM18860
Meas. Tech.
TRalpha-Binding Assay.
pH
7±n/a
Temperature
277.15±n/a K
IC50
1525±n/a nM
Citation
 Hangeland, JJDoweyko, AMDejneka, TFriends, TJDevasthale, PMellström, KSandberg, JGrynfarb, MSack, JSEinspahr, HFärnegård, MHusman, BLjunggren, JKoehler, KSheppard, CMalm, JRyono, DE Thyroid receptor ligands. Part 2: Thyromimetics with improved selectivity for the thyroid hormone receptor beta. Bioorg Med Chem Lett 14:3549-53 (2004)  
Target
Name:
Thyroid hormone receptor alpha
Synonyms:
C-erbA-alpha EAR7 NR1A1 THA_HUMAN THRA1 Thyroid Hormone Receptor (TR-alpha) Thyroid hormone receptor alpha c-erbA-1
Type:
Receptor
Mol. Mass.:
54818.00
Organism:
Homo sapiens (Human)
Description:
Recombinant hThR was obtained from nuclear extracts from SF9 cells infected with baculovirus vectors encoding for ThRalpha 1.
Residue:
490
  
Inhibitor
Name:
BDBM18932
Synonyms:
2-{3,5-dichloro-4-[4-hydroxy-3-(pyridin-2-yl)phenoxy]phenyl}acetic acid | 4-hydroxy thyromimetic, 9n
Type:
Small organic molecule
Emp. Form.:
C19H13Cl2NO4
Mol. Mass.:
390.217
SMILES:
OC(=O)Cc1cc(Cl)c(Oc2ccc(O)c(c2)-c2ccccn2)c(Cl)c1
:
Substrate
Name:
BDBM18860
Synonyms:
(2R)-2-amino-3-[4-(4-hydroxy-3-iodophenoxy)-3,5-diiodophenyl]propanoic acid 3,5,3'-triiodo-L-thyronine (T3) Triiodothyronine US10544075, Compound T3 liothyronine | triothyrone
Type:
Hormone
Emp. Form.:
C15H12I3NO4
Mol. Mass.:
650.9735
SMILES:
N[C@@H](Cc1cc(I)c(Oc2ccc(O)c(I)c2)c(I)c1)C(O)=O
: